Bug 52487 - rebaseline-chromium-webkit-tests should use a mock filesystem
Summary: rebaseline-chromium-webkit-tests should use a mock filesystem
Alias: None
Product: WebKit
Classification: Unclassified
Component: New Bugs (show other bugs)
Version: 528+ (Nightly build)
Hardware: Other OS X 10.5
: P2 Normal
Assignee: Dirk Pranke
Depends on: 52482
  Show dependency treegraph
Reported: 2011-01-14 15:28 PST by Dirk Pranke
Modified: 2011-01-18 13:43 PST (History)
6 users (show)

See Also:

Patch (4.26 KB, patch)
2011-01-14 15:32 PST, Dirk Pranke
ojan: review+
commit-queue: commit-queue-
Details | Formatted Diff | Diff

Note You need to log in before you can comment on or make changes to this bug.
Description Dirk Pranke 2011-01-14 15:28:56 PST
rebaseline-chromium-webkit-tests should use a mock filesystem
Comment 1 Dirk Pranke 2011-01-14 15:32:34 PST
Created attachment 79014 [details]
Comment 2 WebKit Commit Bot 2011-01-18 13:19:49 PST
Comment on attachment 79014 [details]

Rejecting attachment 79014 [details] from commit-queue.

Failed to run "['./Tools/Scripts/webkit-patch', '--status-host=queues.webkit.org', '--bot-id=cr-jail-3', 'apply-..." exit_code: 2

Last 500 characters of output:
2 diffs from patch file(s).
patching file Tools/ChangeLog
Hunk #1 succeeded at 1 with fuzz 3.
patching file Tools/Scripts/webkitpy/layout_tests/rebaseline_chromium_webkit_tests_unittest.py
Hunk #3 FAILED at 129.
Hunk #4 FAILED at 141.
2 out of 4 hunks FAILED -- saving rejects to file Tools/Scripts/webkitpy/layout_tests/rebaseline_chromium_webkit_tests_unittest.py.rej

Failed to run "[u'/mnt/git/webkit-commit-queue/Tools/Scripts/svn-apply', u'--reviewer', u'Ojan Vafai', u'--force']" exit_code: 1

Full output: http://queues.webkit.org/results/7501177
Comment 3 Dirk Pranke 2011-01-18 13:43:27 PST
Committed r76059: <http://trac.webkit.org/changeset/76059>