Bug 41883 - [chromium] Fix deletion has begun assertion in TestImage destructor.
Summary: [chromium] Fix deletion has begun assertion in TestImage destructor.
Alias: None
Product: WebKit
Classification: Unclassified
Component: WebCore Misc. (show other bugs)
Version: 528+ (Nightly build)
Hardware: All All
: P2 Normal
Assignee: Vitaly Repeshko
Depends on:
Reported: 2010-07-08 11:41 PDT by Vitaly Repeshko
Modified: 2010-12-20 22:39 PST (History)
3 users (show)

See Also:

patch (2.81 KB, patch)
2010-07-08 11:43 PDT, Vitaly Repeshko
pfeldman: review+
commit-queue: commit-queue-
Details | Formatted Diff | Diff

Note You need to log in before you can comment on or make changes to this bug.
Description Vitaly Repeshko 2010-07-08 11:41:45 PDT
[chromium] Fix deletion has begun assertion in TestImage destructor.
Comment 1 Vitaly Repeshko 2010-07-08 11:43:04 PDT
Created attachment 60918 [details]
Comment 2 WebKit Commit Bot 2010-08-11 02:20:07 PDT
Comment on attachment 60918 [details]

Rejecting patch 60918 from commit-queue.

Failed to run "[u'/Users/eseidel/Projects/CommitQueue/WebKitTools/Scripts/svn-apply', u'--reviewer', u'Pavel Feldman', u'--force']" exit_code: 1
Parsed 2 diffs from patch file(s).
patching file WebKit/chromium/ChangeLog
Hunk #1 succeeded at 1 with fuzz 3.
patching file WebKit/chromium/tests/DragImageTest.cpp
Hunk #1 succeeded at 48 with fuzz 2 (offset 5 lines).
Hunk #2 FAILED at 118.
Hunk #3 FAILED at 139.
2 out of 3 hunks FAILED -- saving rejects to file WebKit/chromium/tests/DragImageTest.cpp.rej

Full output: http://queues.webkit.org/results/3776045
Comment 3 Eric Seidel (no email) 2010-10-13 12:25:15 PDT
Attachment 60918 [details] was posted by a committer and has review+, assigning to Vitaly Repeshko for commit.
Comment 4 Eric Seidel (no email) 2010-12-20 22:39:37 PST
r62812.  Please use webkit-patch land so that bugs get closed when you land changes.