Bug 41661 - REGRESSION(r62529): http/tests/inspector/resource-har-conversion.html is broken (Requested by yutak on #webkit).
Summary: REGRESSION(r62529): http/tests/inspector/resource-har-conversion.html is brok...
Alias: None
Product: WebKit
Classification: Unclassified
Component: New Bugs (show other bugs)
Version: 528+ (Nightly build)
Hardware: Other OS X 10.5
: P2 Normal
Assignee: WebKit Review Bot
Depends on:
Blocks: 40768
  Show dependency treegraph
Reported: 2010-07-06 00:24 PDT by WebKit Review Bot
Modified: 2010-07-06 01:17 PDT (History)
4 users (show)

See Also:

ROLLOUT of r62529 (30.38 KB, patch)
2010-07-06 00:24 PDT, WebKit Review Bot
no flags Details | Formatted Diff | Diff

Note You need to log in before you can comment on or make changes to this bug.
Description WebKit Review Bot 2010-07-06 00:24:13 PDT
http://trac.webkit.org/changeset/62529 broke the build:
http/tests/inspector/resource-har-conversion.html is broken (Requested by yutak on #webkit).

This is an automatic bug report generated by the sheriff-bot. If this bug
report was created because of a flaky test, please file a bug for the flaky
test (if we don't already have one on file) and dup this bug against that bug
so that we can track how often these flaky tests case pain.

"Only you can prevent forest fires." -- Smokey the Bear
Comment 1 WebKit Review Bot 2010-07-06 00:24:23 PDT
Created attachment 60597 [details]
ROLLOUT of r62529

Any committer can land this patch automatically by marking it commit-queue+.  The commit-queue will build and test the patch before landing to ensure that the rollout will be successful.  This process takes approximately 15 minutes.

If you would like to land the rollout faster, you can use the following command:

  webkit-patch land-attachment ATTACHMENT_ID --ignore-builders

where ATTACHMENT_ID is the ID of this attachment.
Comment 2 WebKit Commit Bot 2010-07-06 01:05:20 PDT
Comment on attachment 60597 [details]
ROLLOUT of r62529

Rejecting patch 60597 from commit-queue.

Failed to run "[u'/Users/eseidel/Projects/CommitQueue/WebKitTools/Scripts/svn-apply', u'--reviewer', u'Kent Tamura', u'--force']" exit_code: 1
Last 500 characters of output:
patching file WebCore/websockets/WebSocketChannel.cpp
Hunk #1 FAILED at 36.
Hunk #2 FAILED at 62.
Hunk #3 FAILED at 111.
Hunk #4 FAILED at 136.
Hunk #5 FAILED at 146.
Hunk #6 FAILED at 237.
Hunk #7 FAILED at 328.
7 out of 7 hunks FAILED -- saving rejects to file WebCore/websockets/WebSocketChannel.cpp.rej
patching file WebCore/websockets/WebSocketChannel.h
Hunk #1 FAILED at 84.
Hunk #2 FAILED at 95.
2 out of 2 hunks FAILED -- saving rejects to file WebCore/websockets/WebSocketChannel.h.rej

Full output: http://webkit-commit-queue.appspot.com/results/3381326
Comment 3 Kent Tamura 2010-07-06 01:17:19 PDT
Committed as r62535