Bug 96540

Summary: [EFL] Compilation error in RenderThemeEfl.cpp
Product: WebKit Reporter: Chris Dumez <cdumez>
Component: WebKit EFLAssignee: Chris Dumez <cdumez>
Status: RESOLVED FIXED    
Severity: Normal CC: gyuyoung.kim, kenneth, lucas.de.marchi, naginenis, rakuco, tmpsantos, webkit.review.bot
Priority: P2    
Version: 528+ (Nightly build)   
Hardware: Unspecified   
OS: Unspecified   
Bug Depends on:    
Bug Blocks: 96501    
Attachments:
Description Flags
Patch none

Description Chris Dumez 2012-09-12 12:10:24 PDT
We get the following error on the EFL debug build bot:
Building CXX object Source/WebCore/CMakeFiles/webcore_efl.dir/platform/efl/RenderThemeEfl.cpp.o
Building CXX object Source/WebCore/CMakeFiles/webcore_efl.dir/platform/efl/ScrollbarEfl.cpp.o
/home/buildslave-1/webkit-buildslave/efl-linux-64-debug/build/Source/WebCore/platform/efl/RenderThemeEfl.cpp: In member function ‘WTF::String WebCore::RenderThemeEfl::themePath() const’:
/home/buildslave-1/webkit-buildslave/efl-linux-64-debug/build/Source/WebCore/platform/efl/RenderThemeEfl.cpp:495:14: error: passing ‘const WebCore::RenderThemeEfl’ as ‘this’ argument of ‘Evas_Object* WebCore::RenderThemeEfl::edje()’ discards qualifiers [-fpermissive]
/home/buildslave-1/webkit-buildslave/efl-linux-64-debug/build/Source/WebCore/platform/efl/RenderThemeEfl.cpp:497:35: error: passing ‘const WebCore::RenderThemeEfl’ as ‘this’ argument of ‘Evas_Object* WebCore::RenderThemeEfl::edje()’ discards qualifiers [-fpermissive]
make[2]: *** [Source/WebCore/CMakeFiles/webcore_efl.dir/platform/efl/RenderThemeEfl.cpp.o] Error 1
Comment 1 Chris Dumez 2012-09-12 12:12:19 PDT
Created attachment 163669 [details]
Patch
Comment 2 Thiago Marcos P. Santos 2012-09-12 12:32:52 PDT
Thanks for fixing Chris!
Comment 3 WebKit Review Bot 2012-09-12 12:41:23 PDT
Comment on attachment 163669 [details]
Patch

Clearing flags on attachment: 163669

Committed r128350: <http://trac.webkit.org/changeset/128350>
Comment 4 WebKit Review Bot 2012-09-12 12:41:27 PDT
All reviewed patches have been landed.  Closing bug.
Comment 5 Sudarsana Nagineni (babu) 2012-09-12 13:44:16 PDT
Thanks for the fix, Chris.