Bug 68647 - [GTK] [Stable] testwebview test fails: do_test_webkit_web_view_adjustments: assertion failed
: [GTK] [Stable] testwebview test fails: do_test_webkit_web_view_adjustments: a...
Status: UNCONFIRMED
: WebKit
WebKit Gtk
: 528+ (Nightly build)
: Unspecified Unspecified
: P2 Normal
Assigned To:
: https://bugs.gentoo.org/show_bug.cgi?...
:
:
:
  Show dependency treegraph
 
Reported: 2011-09-22 11:35 PST by
Modified: 2014-02-02 02:48 PST (History)


Attachments
Full build.log (74.72 KB, text/plain)
2011-09-22 11:35 PST, Pacho Ramos
no flags Details


Note

You need to log in before you can comment on or make changes to this bug.


Description From 2011-09-22 11:35:48 PST
Created an attachment (id=108371) [details]
Full build.log

This looks a regression in 1.4.3 over 1.4.2:

TEST: Programs/unittests/testwebview... (pid=2799)
  /webkit/webview/icon-uri:                                            warning: line 6172: incompatible stripping characters and condition
warning: line 6184: incompatible stripping characters and condition
OK
  /webkit/webview/adjustments:                                         warning: line 6172: incompatible stripping characters and condition
warning: line 6184: incompatible stripping characters and condition
**
ERROR:Source/WebKit/gtk/tests/testwebview.c:245:do_test_webkit_web_view_adjustments: assertion failed (gtk_adjustment_get_value(adjustment) == 100.0): (0 == 100)
FAIL
GTester: last random seed: R02S2c88ebaf2186fd0936fc1bdbea56823c
make[2]: *** [test] Terminado
make[2]: se sale del directorio `/var/tmp/portage/net-libs/webkit-gtk-1.4.3-r300/work/webkit-1.4.3'
make[1]: *** [check-am] Error 2
make[1]: se sale del directorio `/var/tmp/portage/net-libs/webkit-gtk-1.4.3-r300/work/webkit-1.4.3'
make: *** [check] Error 2