Bug 55858 - [EFL] Build break on Debug build.
Summary: [EFL] Build break on Debug build.
Status: RESOLVED FIXED
Alias: None
Product: WebKit
Classification: Unclassified
Component: WebKit EFL (show other bugs)
Version: 528+ (Nightly build)
Hardware: PC Linux
: P2 Normal
Assignee: Nobody
URL:
Keywords:
Depends on:
Blocks:
 
Reported: 2011-03-06 23:16 PST by Ryuan Choi
Modified: 2011-03-07 00:20 PST (History)
2 users (show)

See Also:


Attachments
Patch (1.05 KB, patch)
2011-03-06 23:19 PST, Ryuan Choi
no flags Details | Formatted Diff | Diff

Note You need to log in before you can comment on or make changes to this bug.
Description Ryuan Choi 2011-03-06 23:16:52 PST
/workspace/webkit/Source/WebCore/platform/efl/RenderThemeEfl.cpp: In member function ‘bool WebCore::RenderThemeEfl::themePartCacheEntrySurfaceCreate(WebCore::RenderThemeEfl::ThemePartCacheEntry*)’:
/workspace/webkit/Source/WebCore/platform/efl/RenderThemeEfl.cpp:97:5: error: ‘ce’ was not declared in this scope
make[2]: *** [WebCore/CMakeFiles/webcore_efl.dir/platform/efl/RenderThemeEfl.cpp.o] Error 1
make[1]: *** [WebCore/CMakeFiles/webcore_efl.dir/all] Error 2
make: *** [all] Error 2

It' because ce was changed to entry.
Comment 1 Ryuan Choi 2011-03-06 23:19:31 PST
Created attachment 84923 [details]
Patch
Comment 2 WebKit Commit Bot 2011-03-07 00:20:22 PST
Comment on attachment 84923 [details]
Patch

Clearing flags on attachment: 84923

Committed r80457: <http://trac.webkit.org/changeset/80457>
Comment 3 WebKit Commit Bot 2011-03-07 00:20:27 PST
All reviewed patches have been landed.  Closing bug.