Bug 51113 - REGRESSION(r74117): This broke the GTK1 build. (Requested by mrobinson on #webkit).
Summary: REGRESSION(r74117): This broke the GTK1 build. (Requested by mrobinson on #we...
Alias: None
Product: WebKit
Classification: Unclassified
Component: New Bugs (show other bugs)
Version: 528+ (Nightly build)
Hardware: Other OS X 10.5
: P2 Normal
Assignee: WebKit Review Bot
Depends on:
Blocks: 37369
  Show dependency treegraph
Reported: 2010-12-15 09:37 PST by WebKit Review Bot
Modified: 2010-12-15 12:17 PST (History)
4 users (show)

See Also:

ROLLOUT of r74117 (43.65 KB, patch)
2010-12-15 09:38 PST, WebKit Review Bot
commit-queue: commit-queue-
Details | Formatted Diff | Diff

Note You need to log in before you can comment on or make changes to this bug.
Description WebKit Review Bot 2010-12-15 09:37:40 PST
http://trac.webkit.org/changeset/74117 broke the build:
This broke the GTK1 build. (Requested by mrobinson on #webkit).

This is an automatic bug report generated by the sheriff-bot. If this bug
report was created because of a flaky test, please file a bug for the flaky
test (if we don't already have one on file) and dup this bug against that bug
so that we can track how often these flaky tests case pain.

"Only you can prevent forest fires." -- Smokey the Bear
Comment 1 WebKit Review Bot 2010-12-15 09:38:01 PST
Created attachment 76654 [details]
ROLLOUT of r74117

Any committer can land this patch automatically by marking it commit-queue+.  The commit-queue will build and test the patch before landing to ensure that the rollout will be successful.  This process takes approximately 15 minutes.

If you would like to land the rollout faster, you can use the following command:

  webkit-patch land-attachment ATTACHMENT_ID --ignore-builders

where ATTACHMENT_ID is the ID of this attachment.
Comment 2 Martin Robinson 2010-12-15 10:50:07 PST
Comment on attachment 76654 [details]
ROLLOUT of r74117

Clearing flags on attachment: 76654

Committed r74124: <http://trac.webkit.org/changeset/74124>
Comment 3 Martin Robinson 2010-12-15 10:50:10 PST
All reviewed patches have been landed.  Closing bug.
Comment 4 WebKit Commit Bot 2010-12-15 10:50:27 PST
Comment on attachment 76654 [details]
ROLLOUT of r74117

Rejecting attachment 76654 [details] from commit-queue.

Failed to run "['./WebKitTools/Scripts/webkit-patch', '--status-host=queues.webkit.org', '--bot-id=cr-jail-4', 'apply-attachment', '--non-interactive', 76654]" exit_code: 2
Last 500 characters of output:
atching file WebKitTools/ChangeLog
Hunk #1 succeeded at 1 with fuzz 3.
patching file WebKitTools/Scripts/webkitdirs.pm
Hunk #1 FAILED at 1352.
1 out of 1 hunk FAILED -- saving rejects to file WebKitTools/Scripts/webkitdirs.pm.rej
patching file configure.ac
Hunk #1 FAILED at 902.
Hunk #2 FAILED at 976.
Hunk #3 FAILED at 1054.
3 out of 3 hunks FAILED -- saving rejects to file configure.ac.rej

Failed to run "[u'/mnt/git/webkit-commit-queue/WebKitTools/Scripts/svn-apply', u'--force']" exit_code: 1

Full output: http://queues.webkit.org/results/7163025
Comment 5 WebKit Review Bot 2010-12-15 12:17:44 PST
http://trac.webkit.org/changeset/74124 might have broken GTK Linux 64-bit Debug