Bug 227507 - WebKit_iosmac build failure: SystemPreviewSPI.h:29:9: fatal error: 'AssetViewer/ARQuickLookWebKitItem.h' file not found
Summary: WebKit_iosmac build failure: SystemPreviewSPI.h:29:9: fatal error: 'AssetView...
Status: RESOLVED FIXED
Alias: None
Product: WebKit
Classification: Unclassified
Component: New Bugs (show other bugs)
Version: WebKit Nightly Build
Hardware: Unspecified Unspecified
: P2 Normal
Assignee: Antoine Quint
URL:
Keywords: InRadar
Depends on:
Blocks:
 
Reported: 2021-06-29 14:32 PDT by Antoine Quint
Modified: 2021-06-29 15:50 PDT (History)
6 users (show)

See Also:


Attachments
Patch (3.42 KB, patch)
2021-06-29 14:35 PDT, Antoine Quint
no flags Details | Formatted Diff | Diff

Note You need to log in before you can comment on or make changes to this bug.
Description Antoine Quint 2021-06-29 14:32:45 PDT
WebKit_iosmac build failure: SystemPreviewSPI.h:29:9: fatal error: 'AssetViewer/ARQuickLookWebKitItem.h' file not found
Comment 1 Antoine Quint 2021-06-29 14:35:24 PDT
Created attachment 432532 [details]
Patch
Comment 2 Antoine Quint 2021-06-29 14:35:29 PDT
<rdar://problem/79902043>
Comment 3 EWS 2021-06-29 15:50:24 PDT
Committed r279392 (239257@main): <https://commits.webkit.org/239257@main>

All reviewed patches have been landed. Closing bug and clearing flags on attachment 432532 [details].