Bug 11600 - Webkit fails to build revision 17770 cannot open /WebCore/page/mac
Summary: Webkit fails to build revision 17770 cannot open /WebCore/page/mac
Status: RESOLVED FIXED
Alias: None
Product: WebKit
Classification: Unclassified
Component: New Bugs (show other bugs)
Version: 420+
Hardware: Macintosh OS X 10.4
: P5 Normal
Assignee: Nobody
URL:
Keywords:
Depends on:
Blocks:
 
Reported: 2006-11-14 19:19 PST by Daniel Laughlin
Modified: 2006-11-14 23:13 PST (History)
1 user (show)

See Also:


Attachments

Note You need to log in before you can comment on or make changes to this bug.
Description Daniel Laughlin 2006-11-14 19:19:49 PST
I'm using 10.4.8 (PPC). and the latest developer tools.I tried to build revision 17770 but it failed and gave me the following output:

[ERROR] Can't open directory /Users/daniellaughlin/WebKit/WebCore//Users/daniellaughlin/WebKit/WebCore/page/mac: "No such file or directory"
make: *** [DOMSVGAElement.h] Error 2
make: *** Waiting for unfinished jobs....
** BUILD FAILED **
Comment 1 Mark Rowe (bdash) 2006-11-14 19:53:30 PST
What command are you using to build WebKit?
Comment 2 Mark Rowe (bdash) 2006-11-14 23:13:05 PST
Thanks, fixed in r17775.