Bug 110720 - ./DerivedSources/webkit/WebKitDOMNode.h:25:36: fatal error: webkit/WebKitDOMObject.h: No such file or directory
Summary: ./DerivedSources/webkit/WebKitDOMNode.h:25:36: fatal error: webkit/WebKitDOMO...
Status: UNCONFIRMED
Alias: None
Product: WebKit
Classification: Unclassified
Component: WebKitGTK (show other bugs)
Version: 528+ (Nightly build)
Hardware: Other Linux
: P1 Normal
Assignee: Nobody
URL:
Keywords:
Depends on:
Blocks:
 
Reported: 2013-02-24 21:12 PST by BS_Chauhan
Modified: 2017-03-11 10:49 PST (History)
1 user (show)

See Also:


Attachments

Note You need to log in before you can comment on or make changes to this bug.
Description BS_Chauhan 2013-02-24 21:12:16 PST
Hi,

I am trying to build webkitGtk version 1.11.1 for system type... i686-pc-linux-gnu with DirectFB as target, The build gets failed with attached error below.

In file included from DerivedSources/webkit/WebKitDOMAttr.h:25:0,
                 from DerivedSources/webkit/WebKitDOMAttr.cpp:22:
./DerivedSources/webkit/WebKitDOMNode.h:25:36: fatal error: webkit/WebKitDOMObject.h: No such file or directory
compilation terminated.
make[2]: *** [DerivedSources/webkit/libwebkitgtk_1_0_la-WebKitDOMAttr.lo] Error 1
make[2]: *** Waiting for unfinished jobs....
In file included from DerivedSources/webkit/WebKitDOMBarInfo.cpp:22:0:
DerivedSources/webkit/WebKitDOMBarInfo.h:25:36: fatal error: webkit/WebKitDOMObject.h: No such file or directory
compilation terminated.
make[2]: *** [DerivedSources/webkit/libwebkitgtk_1_0_la-WebKitDOMBarInfo.lo] Error 1
In file included from ./DerivedSources/webkit/WebKitDOMCharacterData.h:25:0,
                 from ./DerivedSources/webkit/WebKitDOMText.h:25,
                 from DerivedSources/webkit/WebKitDOMCDATASection.h:25,
                 from DerivedSources/webkit/WebKitDOMCDATASection.cpp:22:
./DerivedSources/webkit/WebKitDOMNode.h:25:36: fatal error: webkit/WebKitDOMObject.h: No such file or directory
compilation terminated.
In file included from DerivedSources/webkit/WebKitDOMBlob.cpp:22:0:
DerivedSources/webkit/WebKitDOMBlob.h:25:36: fatal error: webkit/WebKitDOMObject.h: No such file or directory
compilation terminated.
make[2]: *** [DerivedSources/webkit/libwebkitgtk_1_0_la-WebKitDOMBlob.lo] Error 1
make[2]: *** [DerivedSources/webkit/libwebkitgtk_1_0_la-WebKitDOMCDATASection.lo] Error 1
In file included from DerivedSources/webkit/WebKitDOMCharacterData.h:25:0,
                 from DerivedSources/webkit/WebKitDOMCharacterData.cpp:22:
./DerivedSources/webkit/WebKitDOMNode.h:25:36: fatal error: webkit/WebKitDOMObject.h: No such file or directory
compilation terminated.
In file included from ./DerivedSources/webkit/WebKitDOMCharacterData.h:25:0,
                 from DerivedSources/webkit/WebKitDOMComment.h:25,
                 from DerivedSources/webkit/WebKitDOMComment.cpp:22:
./DerivedSources/webkit/WebKitDOMNode.h:25:36: fatal error: webkit/WebKitDOMObject.h: No such file or directory
make[2]: *** [DerivedSources/webkit/libwebkitgtk_1_0_la-WebKitDOMCharacterData.lo] Error 1
compilation terminated.
make[2]: *** [DerivedSources/webkit/libwebkitgtk_1_0_la-WebKitDOMComment.lo] Error 1
In file included from DerivedSources/webkit/WebKitDOMConsole.cpp:22:0:
DerivedSources/webkit/WebKitDOMConsole.h:25:36: fatal error: webkit/WebKitDOMObject.h: No such file or directory
compilation terminated.
make[2]: *** [DerivedSources/webkit/libwebkitgtk_1_0_la-WebKitDOMConsole.lo] Error 1
In file included from DerivedSources/webkit/WebKitDOMCSSRule.cpp:22:0:
DerivedSources/webkit/WebKitDOMCSSRule.h:25:36: fatal error: webkit/WebKitDOMObject.h: No such file or directory
compilation terminated.
make[2]: *** [DerivedSources/webkit/libwebkitgtk_1_0_la-WebKitDOMCSSRule.lo] Error 1
In file included from DerivedSources/webkit/WebKitDOMCSSRuleList.cpp:22:0:
DerivedSources/webkit/WebKitDOMCSSRuleList.h:25:36: fatal error: webkit/WebKitDOMObject.h: No such file or directory
compilation terminated.