Bug 53765

Summary: REGRESSION(r77625): It broke Windows builds (Requested by Ossy_ on #webkit).
Product: WebKit Reporter: WebKit Review Bot <webkit.review.bot>
Component: New BugsAssignee: WebKit Review Bot <webkit.review.bot>
Status: RESOLVED FIXED    
Severity: Normal CC: barraclough, commit-queue, ossy, pvarga
Priority: P2    
Version: 528+ (Nightly build)   
Hardware: Other   
OS: OS X 10.5   
Bug Depends on:    
Bug Blocks: 53496    
Attachments:
Description Flags
ROLLOUT of r77625 commit-queue: commit-queue-

Description WebKit Review Bot 2011-02-04 07:05:31 PST
http://trac.webkit.org/changeset/77625 broke the build:
It broke Windows builds (Requested by Ossy_ on #webkit).

This is an automatic bug report generated by the sheriff-bot. If this bug
report was created because of a flaky test, please file a bug for the flaky
test (if we don't already have one on file) and dup this bug against that bug
so that we can track how often these flaky tests case pain.

"Only you can prevent forest fires." -- Smokey the Bear
Comment 1 WebKit Review Bot 2011-02-04 07:05:59 PST
Created attachment 81213 [details]
ROLLOUT of r77625

Any committer can land this patch automatically by marking it commit-queue+.  The commit-queue will build and test the patch before landing to ensure that the rollout will be successful.  This process takes approximately 15 minutes.

If you would like to land the rollout faster, you can use the following command:

  webkit-patch land-attachment ATTACHMENT_ID --ignore-builders

where ATTACHMENT_ID is the ID of this attachment.
Comment 2 WebKit Commit Bot 2011-02-04 07:21:34 PST
Comment on attachment 81213 [details]
ROLLOUT of r77625

Rejecting attachment 81213 [details] from commit-queue.

Failed to run "['./Tools/Scripts/webkit-patch', '--status-host=queues.webkit.org', '--bot-id=cr-jail-4', 'apply-..." exit_code: 2

Last 500 characters of output:
le Source/WebCore/WebCore.gyp/WebCore.gyp
patching file Source/WebCore/WebCore.pro
patching file Source/WebCore/WebCore.vcproj/WebCore.vcproj
Hunk #1 FAILED at 64570.
1 out of 1 hunk FAILED -- saving rejects to file Source/WebCore/WebCore.vcproj/WebCore.vcproj.rej
patching file Source/WebCore/WebCore.vcproj/copyForwardingHeaders.cmd
patching file Source/WebCore/platform/text/RegularExpression.cpp

Failed to run "[u'/mnt/git/webkit-commit-queue/Tools/Scripts/svn-apply', u'--force']" exit_code: 1

Full output: http://queues.webkit.org/results/7697548
Comment 3 WebKit Commit Bot 2011-02-04 07:36:55 PST
Comment on attachment 81213 [details]
ROLLOUT of r77625

Rejecting attachment 81213 [details] from commit-queue.

Failed to run "['./Tools/Scripts/webkit-patch', '--status-host=queues.webkit.org', '--bot-id=cr-jail-3', 'apply-..." exit_code: 2

Last 500 characters of output:
le Source/WebCore/WebCore.gyp/WebCore.gyp
patching file Source/WebCore/WebCore.pro
patching file Source/WebCore/WebCore.vcproj/WebCore.vcproj
Hunk #1 FAILED at 64570.
1 out of 1 hunk FAILED -- saving rejects to file Source/WebCore/WebCore.vcproj/WebCore.vcproj.rej
patching file Source/WebCore/WebCore.vcproj/copyForwardingHeaders.cmd
patching file Source/WebCore/platform/text/RegularExpression.cpp

Failed to run "[u'/mnt/git/webkit-commit-queue/Tools/Scripts/svn-apply', u'--force']" exit_code: 1

Full output: http://queues.webkit.org/results/7700060
Comment 4 Csaba Osztrogon√°c 2011-02-04 10:27:06 PST
rollout landed in http://trac.webkit.org/changeset/77630