Bug 52487

Summary: rebaseline-chromium-webkit-tests should use a mock filesystem
Product: WebKit Reporter: Dirk Pranke <dpranke>
Component: New BugsAssignee: Dirk Pranke <dpranke>
Status: RESOLVED FIXED    
Severity: Normal CC: abarth, commit-queue, eric, mihaip, ojan, tony
Priority: P2    
Version: 528+ (Nightly build)   
Hardware: Other   
OS: OS X 10.5   
Bug Depends on: 52482    
Bug Blocks:    
Attachments:
Description Flags
Patch ojan: review+, commit-queue: commit-queue-

Description Dirk Pranke 2011-01-14 15:28:56 PST
rebaseline-chromium-webkit-tests should use a mock filesystem
Comment 1 Dirk Pranke 2011-01-14 15:32:34 PST
Created attachment 79014 [details]
Patch
Comment 2 WebKit Commit Bot 2011-01-18 13:19:49 PST
Comment on attachment 79014 [details]
Patch

Rejecting attachment 79014 [details] from commit-queue.

Failed to run "['./Tools/Scripts/webkit-patch', '--status-host=queues.webkit.org', '--bot-id=cr-jail-3', 'apply-..." exit_code: 2

Last 500 characters of output:
2 diffs from patch file(s).
patching file Tools/ChangeLog
Hunk #1 succeeded at 1 with fuzz 3.
patching file Tools/Scripts/webkitpy/layout_tests/rebaseline_chromium_webkit_tests_unittest.py
Hunk #3 FAILED at 129.
Hunk #4 FAILED at 141.
2 out of 4 hunks FAILED -- saving rejects to file Tools/Scripts/webkitpy/layout_tests/rebaseline_chromium_webkit_tests_unittest.py.rej

Failed to run "[u'/mnt/git/webkit-commit-queue/Tools/Scripts/svn-apply', u'--reviewer', u'Ojan Vafai', u'--force']" exit_code: 1

Full output: http://queues.webkit.org/results/7501177
Comment 3 Dirk Pranke 2011-01-18 13:43:27 PST
Committed r76059: <http://trac.webkit.org/changeset/76059>